BDBM50000134 2-{2-[2-(2-{2-[2-(2-{2-[2-Acetylamino-3-(4-chloro-phenyl)-propionylamino]-propionylamino}-acetylamino)-3-hydroxy-butyrylamino]-3-methyl-butyrylamino}-3-methyl-pentanoylamino)-3-carbamoyl-propionylamino]-3-carboxy-propionylamino}-4-methyl-pentanoicacid::CHEMBL428090
SMILES CC[C@@H](C)[C@H](NC(=O)[C@@H](NC(=O)[C@@H](NC(=O)CNC(=O)[C@H](C)NC(=O)[C@H](Cc1ccc(Cl)cc1)NC(C)=O)[C@@H](C)O)C(C)C)C(=O)N[C@@H](CC(N)=O)C(=O)N[C@@H](CC(O)=O)C(=O)N[C@@H](CC(C)C)C(O)=O
InChI Key InChIKey=BMQOHMCIGITFQM-VAIKXJNYSA-N
Data  1 IC50
  Tab Delimited (TSV)   2D SDfile   Computed 3D by Vconf -m prep SDfile
Find this compound or compounds like it in BindingDB:
Activity Spreadsheet -- Enzyme Inhibition Constant Data from BindingDB
Found 1 hit for monomerid = 50000134
TargetRibonucleoside-diphosphate reductase large subunit(Homo sapiens (Human))
Notre-Dame Hospital Research
Curated by ChEMBL
LigandPNGBDBM50000134(2-{2-[2-(2-{2-[2-(2-{2-[2-Acetylamino-3-(4-chloro-...)
Affinity DataIC50:  5.60E+3nM. Assay description: Inhibitory concentration against HSV-1 ribonucleotide reductase R1 protein binding
In DepthDetails ArticlePubMed